1 příspěvek / 0 new
Poslední
Neznámý
Obrázek uživatele Neznámý
acpi4asus

Pri pokusu o nainstalovani my to haze nejakou chybu. Nevite prosim vas nekdo cim by to mohlo byt?? Nedari se mi vygooglovat zadne reseni:( Diky moc za kazdou odpoved.

Chybovy kod:

dove@linux-wzjq:~/programs/acpi4asus-0.32> make
make -C driver
make[1]: Entering directory `/home/dove/programs/acpi4asus-0.32/driver'
make -C /lib/modules/2.6.18.2-34-default/build SUBDIRS=/home/dove/programs/acpi4asus-0.32/driver modules
make[2]: Entering directory `/usr/src/linux-2.6.18.2-34-obj/x86_64/default'
make -C ../../../linux-2.6.18.2-34 O=../linux-2.6.18.2-34-obj/x86_64/default modules
CC [M] /home/dove/programs/acpi4asus-0.32/driver/asus_acpi.o
/home/dove/programs/acpi4asus-0.32/driver/asus_acpi.c:105: error: conflicting types for ‘unsupported’
/usr/src/linux-2.6.18.2-34/include/linux/kernel.h:190: error: previous declaration of ‘unsupported’ was here
make[5]: *** [/home/dove/programs/acpi4asus-0.32/driver/asus_acpi.o] Error 1
make[4]: *** [_module_/home/dove/programs/acpi4asus-0.32/driver] Error 2
make[3]: *** [modules] Error 2
make[2]: *** [modules] Error 2
make[2]: Leaving directory `/usr/src/linux-2.6.18.2-34-obj/x86_64/default'
make[1]: *** [default] Error 2
make[1]: Leaving directory `/home/dove/programs/acpi4asus-0.32/driver'
make: *** [build] Error 2

Obrázek uživatele dove
Offline
Naposledy viděn: 13 let 1 měsíc zpět
Připojen: 28.01.2007 - 17:11
sorry za tu gramatickou

sorry za tu gramatickou chybu. Melo tam byt: pri pokusu o nainstalovani MI! to haze nejakou chybu :(